{"text_format":"1","workbook":"xlsx","n_sheets":11,"sheets":["Cuadro A)2) y Gráfico nº 1)","Cuadro A)4) y Gráfico nº 2)","Cuadro A)5) y Gráfico nº 3)","Cuadro A)6) y Gráfico nº 4)","Cuadro nº 9) y Gráfico nº 6","Cuadro nº 11)","Cuadro A)7) y Gráfico nº 7)","Cuadro A)8) y Gráfico A)1)","Cuadro nº 13) y Gráfico nº 8)","Cuadro A)10) y Gráfico","Cálculos Extra"],"not_rendered":{"charts":9,"images":0,"macros":1,"external_links":0,"defined_names":0,"comments":0,"pivot_tables":0},"unopened":[],"bounds":{"document_bytes":16777216,"sheet_cells":100000,"rows_first":2000,"rows_last":500,"rows_between":2000,"halvings":0,"cell_chars":16384,"cell_head_chars":4096},"cells_cut":0,"cells_raw":0,"read":"whole","date_system":"1900"}

{"sheet":"Cuadro A)2) y Gráfico nº 1)","index":0,"n_rows":38,"n_cols":13,"rows_kept":38,"cut":false,"hidden":false,"merged":[[2,2,3,44],[1,2,1,44],[5,12,5,18],[6,12,6,18],[8,1,8,2],[8,3,8,4],[8,5,8,6],[8,7,8,8],[7,1,7,9]]}
[]
[null,null,"INSTRUCCIONES"]
[null,null,"0. Antes de empezar una técnica de grupo nueva pulse en el siguiente botón \"Reiniciar\" para borrar todos los datos introducidos \n1. De cada problema definido por el grupo que figura en el Cuadro A)1) del Anexo extraer los datos de las columnas 4ª (Ideas, Cantidad) y 6ª (Participante, Cantidad) y trasladarlas al Cuadro A)2)\n2. Tras el calculo de los datos por EXCEL las ideas NO estarán ordenadas de mayor a menor por su importancia relativa. Antes de pasar a la pestaña \"Cuadro A)4) y Gráfico nº 2) debe pulsar el botón \"Ordenar datos\""]
[]
[]
[null,null,null,null,null,null,null,null,null,null,null,null,"Celdas editables"]
[null,null,null,null,null,null,null,null,null,null,null,null,"Celdas no editables"]
[null,"Cuadro A)2) Las ideas individuales antes de consignarlas en los Post-It"]
[null,"LOS PROBLEMAS",null,"IDEAS",null,"PARTICIPANTES",null,"PONDERACIÓN",null,"ACUMULADO"]
[null,"Letra","Definidos después por el grupo","Cantidad","%","Cantidad","%","I  x  P","%","%"]
{"$rows_left_out":29}
{"sheet":"Cuadro A)4) y Gráfico nº 2)","index":1,"n_rows":39,"n_cols":13,"rows_kept":39,"cut":false,"hidden":false,"merged":[[6,12,6,18],[1,1,1,44],[2,1,3,44],[5,12,5,18],[9,1,9,2],[9,3,9,4],[9,5,9,6],[9,7,9,9],[7,1,7,9],[8,1,8,2],[8,3,8,9]]}
[]
[null,"INSTRUCCIONES"]
[null,"0. Si existen datos en la tabla de otra técnica, antes de continuar con la técnica de grupo nueva pulse en el botón \"Reiniciar\" para borrar todos los datos introducidos.\n1. Se procederá de modo análogo al paso anterior pero anotando los datos en el Cuadro nº 4).\n2. Tras el calculo de los datos por EXCEL las ideas NO estarán ordenadas de mayor a menor por su importancia relativa. Antes de pasar a la pestaña \"Cuadro A)5) y Gráfico nº 3) debe pulsar el botón \"Ordenar datos\""]
[]
[]
[null,null,null,null,null,null,null,null,null,null,null,null,"Celdas editables"]
[null,null,null,null,null,null,null,null,null,null,null,null,"Celdas no editables"]
[null,"Cuadro A)4) Percepción individual de la importancia de los problemas (en los Post-It)"]
[null,"CONCEPTOS-SÍNTESIS",null,"DATOS Y CÁLCULO DE LA PERCEPCIÓN INDIVIDUAL"]
[null,"I D E A S    G E N E R A L E S",null,"Nº de tarjetas (T)",null,"Nº de participantes (P)",null,"PONDERACIÓN (T x P)"]
{"$rows_left_out":30}
{"sheet":"Cuadro A)5) y Gráfico nº 3)","index":2,"n_rows":38,"n_cols":9,"rows_kept":38,"cut":false,"hidden":false,"merged":[[8,1,8,2],[8,3,8,5],[7,1,7,5],[1,1,1,44],[2,1,3,44],[5,8,5,14],[6,8,6,14]]}
[]
[null,"INSTRUCCIONES"]
[null,"0. Si existen datos en la tabla de otra técnica, antes de continuar con la técnica de grupo nueva pulse en el botón \"Reiniciar\" para borrar todos los datos introducidos.\n1. Rellenar la columna de número de votos del Cuadro nº 5).\n2. Tras el calculo de los datos por EXCEL las ideas NO estarán ordenadas de mayor a menor por su importancia relativa. Antes de pasar a la pestaña \"Cuadro A)6) y Gráfico nº 4) debe pulsar el botón \"Ordenar datos\""]
[]
[]
[null,null,null,null,null,null,null,null,"Celdas editables"]
[null,null,null,null,null,null,null,null,"Celdas no editables"]
[null,"Cuadro A)5) La percepción grupal de los problemas (directa)"]
[null,"CONCEPTOS SÍNTESIS",null,"VOTOS"]
[null,"Descripción de los problemas","Letra","Nº","%","% Acumulado"]
{"$rows_left_out":29}
{"sheet":"Cuadro A)6) y Gráfico nº 4)","index":3,"n_rows":38,"n_cols":13,"rows_kept":38,"cut":false,"hidden":false,"merged":[[8,1,8,2],[8,3,8,4],[8,5,8,6],[8,7,8,9],[1,1,1,44],[2,1,3,44],[5,12,5,18],[6,12,6,18],[7,1,7,9]]}
[]
[null,"INSTRUCCIONES"]
[null,"0. Si existen datos en la tabla de otra técnica, antes de continuar con la técnica de grupo nueva pulse en el botón \"Reiniciar\" para borrar todos los datos introducidos.\n1. Los datos del trabajo en grupo, se trasladarán al Cuadro A)6) el número de votos y número de participantes (que votaron cada idea) \n2. Tras el calculo de los datos por EXCEL las ideas NO estarán ordenadas de mayor a menor por su importancia relativa. Antes de pasar a la pestaña \"Cuadro nº 9) y Gráfico nº 6) debe pulsar el botón \"Ordenar datos\""]
[]
[]
[null,null,null,null,null,null,null,null,null,null,null,null,"Celdas editables"]
[null,null,null,null,null,null,null,null,null,null,null,null,"Celdas no editables"]
[null,"Cuadro A)6) La percepción grupal de los problemas (ponderada)"]
[null,"CONCEPTOS-SÍNTESIS",null,"VOTOS",null,"PARTICIPANTES",null,"PONDERACIÓN"]
[null,"Descripción de los problemas","Letra","nº","%","nº","%","VxP","%","% Acumulado"]
{"$rows_left_out":29}
{"sheet":"Cuadro nº 9) y Gráfico nº 6","index":4,"n_rows":40,"n_cols":35,"rows_kept":40,"cut":false,"hidden":false,"merged":[[39,2,39,28],[37,29,39,31],[8,1,8,31],[37,0,37,1],[9,29,9,30],[10,30,36,30],[10,31,36,31],[5,34,5,40],[6,34,6,40],[2,2,3,49],[1,2,1,49],[38,2,38,28]]}
[]
[null,null,"INSTRUCCIONES"]
[null,null,"0. Si existen datos en la tabla de otra técnica, antes de continuar con la técnica de grupo nueva pulse en el botón \"Reiniciar\" para borrar todos los datos introducidos.\n1. Se trasladarán al Cuadro nº 9) del texto estos datos"]
[]
[]
[null,null,null,null,null,null,null,null,null,null,null,null,null,null,null,null,null,null,null,null,null,null,null,null,null,null,null,null,null,null,null,null,null,null,"Celdas editables"]
[null,null,null,null,null,null,null,null,null,null,null,null,null,null,null,null,null,null,null,null,null,null,null,null,null,null,null,null,null,null,null,null,null,null,"Celdas no editables"]
[]
[null,"Cuadro nº 9) La matriz dependencia/motricidad de los problemas (matriz D/N)"]
[null,null,"A","B","C","D","E","F","G","H","I","J","K","L","M","N","Ñ","O","P","Q","R","S","T","U","V","W","X","Y","Z","SUMA"]
{"$rows_left_out":31}
{"sheet":"Cuadro nº 11)","index":5,"n_rows":38,"n_cols":34,"rows_kept":38,"cut":false,"hidden":false,"merged":[[7,29,7,30],[8,30,34,30],[8,31,34,31],[35,0,35,1],[35,29,37,31],[36,2,36,28],[37,2,37,28],[5,33,5,39],[2,2,2,29],[3,2,3,29],[4,33,4,39],[6,1,6,31]]}
[]
[]
[null,null,"INSTRUCCIONES"]
[null,null,"Los datos de esta tabla se calculan automáticamente, por lo que no es necesario rellenar nada"]
[null,null,null,null,null,null,null,null,null,null,null,null,null,null,null,null,null,null,null,null,null,null,null,null,null,null,null,null,null,null,null,null,null,"Celdas editables"]
[null,null,null,null,null,null,null,null,null,null,null,null,null,null,null,null,null,null,null,null,null,null,null,null,null,null,null,null,null,null,null,null,null,"Celdas no editables"]
[null,"Cuadro nº 11) La matriz número de relaciones entre los problemas (matriz NR)"]
[null,null,"A","B","C","D","E","F","G","H","I","J","K","L","M","N","Ñ","O","P","Q","R","S","T","U","V","W","X","Y","Z","SUMA"]
[null,"A",{"$f":"IF('Cuadro nº 9) y Gráfico nº 6'!C11>0,1,0)","v":0},{"$f":"IF('Cuadro nº 9) y Gráfico nº 6'!D11>0,1,0)","v":0},{"$f":"IF('Cuadro nº 9) y Gráfico nº 6'!E11>0,1,0)","v":0},{"$f":"IF('Cuadro nº 9) y Gráfico nº 6'!F11>0,1,0)","v":0},{"$f":"IF('Cuadro nº 9) y Gráfico nº 6'!G11>0,1,0)","v":0},{"$f":"IF('Cuadro nº 9) y Gráfico nº 6'!H11>0,1,0)","v":0},{"$f":"IF('Cuadro nº 9) y Gráfico nº 6'!I11>0,1,0)","v":0},{"$f":"IF('Cuadro nº 9) y Gráfico nº 6'!J11>0,1,0)","v":0},{"$f":"IF('Cuadro nº 9) y Gráfico nº 6'!K11>0,1,0)","v":0},{"$f":"IF('Cuadro nº 9) y Gráfico nº 6'!L11>0,1,0)","v":0},{"$f":"IF('Cuadro nº 9) y Gráfico nº 6'!M11>0,1,0)","v":0},{"$f":"IF('Cuadro nº 9) y Gráfico nº 6'!N11>0,1,0)","v":0},{"$f":"IF('Cuadro nº 9) y Gráfico nº 6'!O11>0,1,0)","v":0},{"$f":"IF('Cuadro nº 9) y Gráfico nº 6'!P11>0,1,0)","v":0},{"$f":"IF('Cuadro nº 9) y Gráfico nº 6'!Q11>0,1,0)","v":0},{"$f":"IF('Cuadro nº 9) y Gráfico nº 6'!R11>0,1,0)","v":0},{"$f":"IF('Cuadro nº 9) y Gráfico nº 6'!S11>0,1,0)","v":0},{"$f":"IF('Cuadro nº 9) y Gráfico nº 6'!T11>0,1,0)","v":0},{"$f":"IF('Cuadro nº 9) y Gráfico nº 6'!U11>0,1,0)","v":0},{"$f":"IF('Cuadro nº 9) y Gráfico nº 6'!V11>0,1,0)","v":0},{"$f":"IF('Cuadro nº 9) y Gráfico nº 6'!W11>0,1,0)","v":0},{"$f":"IF('Cuadro nº 9) y Gráfico nº 6'!X11>0,1,0)","v":0},{"$f":"IF('Cuadro nº 9) y Gráfico nº 6'!Y11>0,1,0)","v":0},{"$f":"IF('Cuadro nº 9) y Gráfico nº 6'!Z11>0,1,0)","v":0},{"$f":"IF('Cuadro nº 9) y Gráfico nº 6'!AA11>0,1,0)","v":0},{"$f":"IF('Cuadro nº 9) y Gráfico nº 6'!AB11>0,1,0)","v":0},{"$f":"IF('Cuadro nº 9) y Gráfico nº 6'!AC11>0,1,0)","v":0},{"$f":"SUM(C9:AC9)","v":0},"NÚMERO DE RELACIONES TRANSMITIDAS","EJE Y"]
[null,"B",{"$f":"IF('Cuadro nº 9) y Gráfico nº 6'!C12>0,1,0)","v":0},{"$f":"IF('Cuadro nº 9) y Gráfico nº 6'!D12>0,1,0)","v":0},{"$f":"IF('Cuadro nº 9) y Gráfico nº 6'!E12>0,1,0)","v":0},{"$f":"IF('Cuadro nº 9) y Gráfico nº 6'!F12>0,1,0)","v":0},{"$f":"IF('Cuadro nº 9) y Gráfico nº 6'!G12>0,1,0)","v":0},{"$f":"IF('Cuadro nº 9) y Gráfico nº 6'!H12>0,1,0)","v":0},{"$f":"IF('Cuadro nº 9) y Gráfico nº 6'!I12>0,1,0)","v":0},{"$f":"IF('Cuadro nº 9) y Gráfico nº 6'!J12>0,1,0)","v":0},{"$f":"IF('Cuadro nº 9) y Gráfico nº 6'!K12>0,1,0)","v":0},{"$f":"IF('Cuadro nº 9) y Gráfico nº 6'!L12>0,1,0)","v":0},{"$f":"IF('Cuadro nº 9) y Gráfico nº 6'!M12>0,1,0)","v":0},{"$f":"IF('Cuadro nº 9) y Gráfico nº 6'!N12>0,1,0)","v":0},{"$f":"IF('Cuadro nº 9) y Gráfico nº 6'!O12>0,1,0)","v":0},{"$f":"IF('Cuadro nº 9) y Gráfico nº 6'!P12>0,1,0)","v":0},{"$f":"IF('Cuadro nº 9) y Gráfico nº 6'!Q12>0,1,0)","v":0},{"$f":"IF('Cuadro nº 9) y Gráfico nº 6'!R12>0,1,0)","v":0},{"$f":"IF('Cuadro nº 9) y Gráfico nº 6'!S12>0,1,0)","v":0},{"$f":"IF('Cuadro nº 9) y Gráfico nº 6'!T12>0,1,0)","v":0},{"$f":"IF('Cuadro nº 9) y Gráfico nº 6'!U12>0,1,0)","v":0},{"$f":"IF('Cuadro nº 9) y Gráfico nº 6'!V12>0,1,0)","v":0},{"$f":"IF('Cuadro nº 9) y Gráfico nº 6'!W12>0,1,0)","v":0},{"$f":"IF('Cuadro nº 9) y Gráfico nº 6'!X12>0,1,0)","v":0},{"$f":"IF('Cuadro nº 9) y Gráfico nº 6'!Y12>0,1,0)","v":0},{"$f":"IF('Cuadro nº 9) y Gráfico nº 6'!Z12>0,1,0)","v":0},{"$f":"IF('Cuadro nº 9) y Gráfico nº 6'!AA12>0,1,0)","v":0},{"$f":"IF('Cuadro nº 9) y Gráfico nº 6'!AB12>0,1,0)","v":0},{"$f":"IF('Cuadro nº 9) y Gráfico nº 6'!AC12>0,1,0)","v":0},{"$f":"SUM(C10:AC10)","v":0}]
{"$rows_left_out":29}
{"sheet":"Cuadro A)7) y Gráfico nº 7)","index":6,"n_rows":40,"n_cols":17,"rows_kept":40,"cut":false,"hidden":false,"merged":[[6,16,6,22],[2,1,2,13],[3,1,4,13],[5,16,5,22],[10,1,10,2],[10,3,10,6],[10,7,10,10],[10,11,10,13],[8,1,8,13],[9,1,9,13]]}
[]
[]
[null,"INSTRUCCIONES"]
[null,"0. Los datos de esta tabla se calculan automáticamente, por lo que no es necesario rellenar nada\n1. Tras el calculo de los datos por EXCEL los datos no estarán ordenador. Antes de pasar a la pestaña \"Cuadro A)8) y Gráfico A)1) debe pulsar el botón \"Ordenar datos\""]
[]
[null,null,null,null,null,null,null,null,null,null,null,null,null,null,null,null,"Celdas editables"]
[null,null,null,null,null,null,null,null,null,null,null,null,null,null,null,null,"Celdas no editables"]
[]
[null,"Cuadro A)7) La estructura de los problemas: Potencia relacional"]
[null,"CÁLCULO DE LA POTENCIA RELACIONAL"]
{"$rows_left_out":31}
{"sheet":"Cuadro A)8) y Gráfico A)1)","index":7,"n_rows":38,"n_cols":34,"rows_kept":38,"cut":false,"hidden":false,"merged":[[7,29,7,30],[8,30,34,30],[8,31,34,31],[35,0,35,1],[35,29,37,31],[36,2,36,28],[37,2,37,28],[2,2,2,29],[3,2,3,29],[2,33,2,39],[3,33,3,39],[6,1,6,31]]}
[]
[]
[null,null,"INSTRUCCIONES",null,null,null,null,null,null,null,null,null,null,null,null,null,null,null,null,null,null,null,null,null,null,null,null,null,null,null,null,null,null,"Celdas editables"]
[null,null,"Los datos de esta tabla se calculan automáticamente, por lo que no es necesario rellenar nada",null,null,null,null,null,null,null,null,null,null,null,null,null,null,null,null,null,null,null,null,null,null,null,null,null,null,null,null,null,null,"Celdas no editables"]
[]
[]
[null,"Cuadro A)8) Matriz dependencia/motricidad al cuadrado"]
[null,null,"A","B","C","D","E","F","G","H","I","J","K","L","M","N","Ñ","O","P","Q","R","S","T","U","V","W","X","Y","Z","SUMA"]
[null,"A",{"$f":"MMULT('Cuadro nº 9) y Gráfico nº 6'!C11:AC37,'Cuadro nº 9) y Gráfico nº 6'!C11:AC37)","v":0},0,0,0,0,0,0,0,0,0,0,0,0,0,0,0,0,0,0,0,0,0,0,0,0,0,0,{"$f":"SUM(C9:AC9)","v":0},"SUMA DE LA INFLUENCIA TRANSMITIDA","EJE Y"]
[null,"B",0,0,0,0,0,0,0,0,0,0,0,0,0,0,0,0,0,0,0,0,0,0,0,0,0,0,0,{"$f":"SUM(C10:AC10)","v":0}]
{"$rows_left_out":29}
{"sheet":"Cuadro nº 13) y Gráfico nº 8)","index":8,"n_rows":38,"n_cols":34,"rows_kept":38,"cut":false,"hidden":false,"merged":[[7,29,7,30],[8,30,34,30],[8,31,34,31],[35,0,35,1],[35,29,37,31],[36,2,36,28],[37,2,37,28],[2,2,2,29],[3,2,3,29],[3,33,3,39],[4,33,4,39],[6,1,6,31]]}
[]
[]
[null,null,"INSTRUCCIONES"]
[null,null,"Los datos de esta tabla se calculan automáticamente, por lo que no es necesario rellenar nada",null,null,null,null,null,null,null,null,null,null,null,null,null,null,null,null,null,null,null,null,null,null,null,null,null,null,null,null,null,null,"Celdas editables"]
[null,null,null,null,null,null,null,null,null,null,null,null,null,null,null,null,null,null,null,null,null,null,null,null,null,null,null,null,null,null,null,null,null,"Celdas no editables"]
[]
[null,"Cuadro nº 13) Matriz dependencia/motricidad al cubo"]
[null,null,"A","B","C","D","E","F","G","H","I","J","K","L","M","N","Ñ","O","P","Q","R","S","T","U","V","W","X","Y","Z","SUMA"]
[null,"A",{"$f":"MMULT('Cuadro A)8) y Gráfico A)1)'!C9:AC35,'Cuadro nº 9) y Gráfico nº 6'!C11:AC37)","v":0},0,0,0,0,0,0,0,0,0,0,0,0,0,0,0,0,0,0,0,0,0,0,0,0,0,0,{"$f":"SUM(C9:AC9)","v":0},"SUMA DE LA INFLUENCIA TRANSMITIDA","EJE Y"]
[null,"B",0,0,0,0,0,0,0,0,0,0,0,0,0,0,0,0,0,0,0,0,0,0,0,0,0,0,0,{"$f":"SUM(C10:AC10)","v":0}]
{"$rows_left_out":29}
{"sheet":"Cuadro A)10) y Gráfico","index":9,"n_rows":40,"n_cols":12,"rows_kept":40,"cut":false,"hidden":false,"merged":[[10,3,10,4],[10,5,10,6],[10,7,10,8],[9,1,10,2],[9,3,9,9],[6,11,6,17],[7,11,7,17],[1,1,1,17],[2,1,3,17],[8,1,8,9]]}
[]
[null,"INSTRUCCIONES"]
[null,"0. Si existen datos en la tabla de otra técnica, antes de continuar con la técnica de grupo nueva pulse en el botón \"Reiniciar\" para borrar todos los datos introducidos.\n1. Los datos del trabajo en grupo, se trasladarán al Cuadro A)10) la cantidad de soluciones según el problema y la cantidad de soluciones según los participantres. \n2. Tras el calculo de los datos por EXCEL las ideas NO estarán ordenadas de mayor a menor por su importancia relativa. Antes de pasar a la pestaña \"Cuadro nº 9) y Gráfico nº 6) debe pulsar el botón \"Ordenar datos\""]
[]
[]
[]
[null,null,null,null,null,null,null,null,null,null,null,"Celdas editables"]
[null,null,null,null,null,null,null,null,null,null,null,"Celdas no editables"]
[null,"Cuadro A)10) Cuantificación de las soluciones (individuales en las hojas) según el problema de referencia"]
[null,"LOS PROBLEMAS",null,"SOLUCIONES"]
{"$rows_left_out":31}
{"sheet":"Cálculos Extra","index":10,"n_rows":32,"n_cols":13,"rows_kept":32,"cut":false,"hidden":false,"merged":[[3,12,3,18],[1,1,1,10],[2,1,2,2],[2,3,2,6],[2,7,2,10],[2,12,2,18]]}
[]
[null,"CÁLCULOS EXTRA. NO TOCAR."]
[null,"PROBLEMAS",null,"SUMA DE INFLUENCIA (D/M)^2",null,null,null,"SUMA DE INFLUENCIA (D/M)^3",null,null,null,null,"Celdas editables"]
[null,"Definición","Letra","Trans.^2","Recib.^2","Total^2","%^2","Trans.^3","Recib.^3","Total^3","%^3",null,"Celdas no editables"]
[null,{"$f":"VLOOKUP(C5,'Cuadro A)2) y Gráfico nº 1)'!$B$11:$C$37,2,0)","v":0},"A",{"$f":"'Cuadro A)8) y Gráfico A)1)'!AD9","v":0},{"$f":"'Cuadro A)8) y Gráfico A)1)'!C36","v":0},{"$f":"D5+E5","v":0},{"$f":"F5/$F$32","v":{"$error":"#DIV/0!"}},{"$f":"'Cuadro nº 13) y Gráfico nº 8)'!AD9","v":0},{"$f":"'Cuadro nº 13) y Gráfico nº 8)'!C36","v":0},{"$f":"H5+I5","v":0},{"$f":"J5/$J$32","v":{"$error":"#DIV/0!"}}]
[null,{"$f":"VLOOKUP(C6,'Cuadro A)2) y Gráfico nº 1)'!$B$11:$C$37,2,0)","v":0},"B",{"$f":"'Cuadro A)8) y Gráfico A)1)'!AD10","v":0},{"$f":"'Cuadro A)8) y Gráfico A)1)'!D36","v":0},{"$f":"D6+E6","v":0},{"$f":"F6/$F$32","v":{"$error":"#DIV/0!"}},{"$f":"'Cuadro nº 13) y Gráfico nº 8)'!AD10","v":0},{"$f":"'Cuadro nº 13) y Gráfico nº 8)'!D36","v":0},{"$f":"H6+I6","v":0},{"$f":"J6/$J$32","v":{"$error":"#DIV/0!"}}]
[null,{"$f":"VLOOKUP(C7,'Cuadro A)2) y Gráfico nº 1)'!$B$11:$C$37,2,0)","v":0},"C",{"$f":"'Cuadro A)8) y Gráfico A)1)'!AD11","v":0},{"$f":"'Cuadro A)8) y Gráfico A)1)'!E36","v":0},0,{"$error":"#DIV/0!"},{"$f":"'Cuadro nº 13) y Gráfico nº 8)'!AD11","v":0},{"$f":"'Cuadro nº 13) y Gráfico nº 8)'!E36","v":0},0,{"$error":"#DIV/0!"}]
[null,{"$f":"VLOOKUP(C8,'Cuadro A)2) y Gráfico nº 1)'!$B$11:$C$37,2,0)","v":0},"D",{"$f":"'Cuadro A)8) y Gráfico A)1)'!AD12","v":0},{"$f":"'Cuadro A)8) y Gráfico A)1)'!F36","v":0},0,{"$error":"#DIV/0!"},{"$f":"'Cuadro nº 13) y Gráfico nº 8)'!AD12","v":0},{"$f":"'Cuadro nº 13) y Gráfico nº 8)'!F36","v":0},0,{"$error":"#DIV/0!"}]
[null,{"$f":"VLOOKUP(C9,'Cuadro A)2) y Gráfico nº 1)'!$B$11:$C$37,2,0)","v":0},"E",{"$f":"'Cuadro A)8) y Gráfico A)1)'!AD13","v":0},{"$f":"'Cuadro A)8) y Gráfico A)1)'!G36","v":0},0,{"$error":"#DIV/0!"},{"$f":"'Cuadro nº 13) y Gráfico nº 8)'!AD13","v":0},{"$f":"'Cuadro nº 13) y Gráfico nº 8)'!G36","v":0},0,{"$error":"#DIV/0!"}]
[null,{"$f":"VLOOKUP(C10,'Cuadro A)2) y Gráfico nº 1)'!$B$11:$C$37,2,0)","v":0},"F",{"$f":"'Cuadro A)8) y Gráfico A)1)'!AD14","v":0},{"$f":"'Cuadro A)8) y Gráfico A)1)'!H36","v":0},0,{"$error":"#DIV/0!"},{"$f":"'Cuadro nº 13) y Gráfico nº 8)'!AD14","v":0},{"$f":"'Cuadro nº 13) y Gráfico nº 8)'!H36","v":0},0,{"$error":"#DIV/0!"}]
{"$rows_left_out":22}